BGS Lexicon of Named Rock Units: Classification Type
access rights: The dataset is made freely available for access, e.g. via the Internet. Either no third party data / information is contained in the dataset or BGS has secured written permission from the owner(s) of any third party data / information contained in the dataset to make the dataset freely accessible.
type: ConceptScheme
label: Lexicon classification type

Age Based
type: Concept
in scheme: BGS Lexicon of Named Rock Units: Classification Type
comment: Unit classified according to age (or composite age or age range). E.g. Devonian rocks, undifferentiated. Always Informal.

Composite
type: Concept
in scheme: BGS Lexicon of Named Rock Units: Classification Type
comment: Composite unit of two or more individually defined units, but not itself a valid unit. E.g. Penarth Group and Lias Group, undifferentiated. Always Informal, although the components may individually be Formal.

Lithodemic Intrusive
type: Concept
in scheme: BGS Lexicon of Named Rock Units: Classification Type
comment: Units of igneous intrusive origin and their recognisable metamorphosed equivalents. E.g. Mull Dyke Swarm; Criffel-Dalbeattie Pluton; Fethaland Metagabbro. Formal or Informal.

Lithodemic Mixed-class
type: Concept
in scheme: BGS Lexicon of Named Rock Units: Classification Type
comment: Mappable units comprising child units that represent two or more of the three classes of unit that are distinguished and delimited on the basis of rock characteristics (lithostratigraphical, intrusive and tectono-metamorphic), each in sufficient proportion that the essential character of the parent unit is 'mixed'; for example, a mappable unit encompassing a sill-swarm (intrusive) and its sedimentary country rocks (lithostratigraphical). E.g. Lewisian Supercomplex; Anglesey Megacomplex. Formal or Informal.

Lithodemic Tectono-metamorphic
type: Concept
in scheme: BGS Lexicon of Named Rock Units: Classification Type
comment: Predominantly single-class mappable units whose original character and/or setting has been modified substantially by deformation and/or metamorphism such that they cannot now be classified as, or linked to, a formally recognised lithostratigraphical unit or intrusive unit. Includes intensely deformed units such as fault rocks, shear zones, cataclasites, mylonites and impactites. E.g. An Cnoc Quartzite Lens; Newtown Harzburgite Layer; Glen Trail Amphibolite Train; Glen Ordie Metasedimentary Parcel; Strathy Gneiss Package; Menai Assemblage. Formal or Informal.

Litho-morpho-genetic
type: Concept
in scheme: BGS Lexicon of Named Rock Units: Classification Type
comment: Generic types of superficial deposit based primarily on lithology, morphology, genesis or combination of these; sometimes with geographic or age qualifiers but no lithostratigraphical name. E.g. Peat; Tidal Flat Deposits; Alluvium; River Terrace Deposits; Blown Sand; Glaciofluvial Deposits; Till; Hummock (Moundy) Glacial Deposits. Always Informal.

Lithostratigraphical
type: Concept
in scheme: BGS Lexicon of Named Rock Units: Classification Type
comment: Stratified units (conforming to the law of superposition) including sedimentary, volcanic and volcaniclastic units and their recognisable metamorphosed equivalents. E.g. Culver Chalk Formation; Borrowdale Volcanic Group; Litton Tuff Member; Tummel Psammite Formation; Binnein Schist Member. Formal or Informal.

Man Made Ground
type: Concept
in scheme: BGS Lexicon of Named Rock Units: Classification Type
comment: All anthropogenic deposits or excavations. E.g. Made Ground (undivided). Always Informal (q.v).

Miscellaneous
type: Concept
in scheme: BGS Lexicon of Named Rock Units: Classification Type
comment: Rock unit that cannot properly be classified as any of the others. E.g. Unnamed Mineral Flat in Carboniferous limestone. Always Informal.

Not Applicable
type: Concept
in scheme: BGS Lexicon of Named Rock Units: Classification Type
comment: Not applicable

Not Entered
type: Concept
in scheme: BGS Lexicon of Named Rock Units: Classification Type
comment: We have not assigned a value yet (and it might not be applicable)