Location, bounding box, point
access rights: The dataset is made freely available for access, e.g. via the Internet. Either no third party data / information is contained in the dataset or BGS has secured written permission from the owner(s) of any third party data / information contained in the dataset to make the dataset freely accessible.
creator: foaf.rdf
publisher: foaf.rdf

Bounding Box
access rights: The dataset is made freely available for access, e.g. via the Internet. Either no third party data / information is contained in the dataset or BGS has secured written permission from the owner(s) of any third party data / information contained in the dataset to make the dataset freely accessible.
type: Property
range: XMLLiteral
comment: This property gives a bounding box for the location of the subject. Should be expressed in GML.

Footprint
access rights: The dataset is made freely available for access, e.g. via the Internet. Either no third party data / information is contained in the dataset or BGS has secured written permission from the owner(s) of any third party data / information contained in the dataset to make the dataset freely accessible.
type: Property
range: XMLLiteral
comment: This property gives the 2D spatial footprint of the subject. Should be expressed in GML.

Location Description
access rights: The dataset is made freely available for access, e.g. via the Internet. Either no third party data / information is contained in the dataset or BGS has secured written permission from the owner(s) of any third party data / information contained in the dataset to make the dataset freely accessible.
type: Property
range: Literal
comment: Property gives a textual description of where something is located.

A single point location
access rights: The dataset is made freely available for access, e.g. via the Internet. Either no third party data / information is contained in the dataset or BGS has secured written permission from the owner(s) of any third party data / information contained in the dataset to make the dataset freely accessible.
type: Property
range: XMLLiteral
comment: This property gives the location of its subject approximated as a single representative point. Should be expressed in GML.